{"text_format":"2","workbook":"xlsx","n_sheets":10,"sheets":["11.25","11.25待再次核实","11.26","11.28调整入库","11.26待再次核实","11.27","11.29待再次核实","12.02","12.02待再次确认","12.03"],"not_rendered":{"charts":0,"images":5,"macros":0,"external_links":1,"defined_names":6,"comments":0,"pivot_tables":0},"unopened":[],"bounds":{"document_bytes":16777216,"sheet_cells":100000,"run_cost":"one","rows_first":2000,"rows_last":500,"rows_between":2000,"halvings":0,"cell_chars":16384,"cell_head_chars":4096},"cells_cut":0,"cells_raw":0,"read":"whole","date_system":"1900"}

{"sheet":"11.25","index":0,"n_rows":78,"n_cols":7,"rows_kept":78,"cut":false,"hidden":false,"merged":[]}
["尺组合","条码","发货后发货仓库存清点","ERP库存","差异","最新入库情况","出库情况"]
["直条半蕾丝头套10","STWLFW10",37,31,6]
["直条半蕾丝头套12","STWLFW12",29,27,2]
["直条半蕾丝头套14","STWLFW14",27,26,1]
["直条半蕾丝头套16","STWLFW16",11,11,0]
["直条半蕾丝头套18","STWLFW18",22,25,-3]
["直条半蕾丝头套20","STWLFW20",17,20,-3]
["直条半蕾丝头套22","STWLFW22",23,31,-8,"2019/11/23 89/90批入 9\n2019-11-02 81批入 10",21]
["直条半蕾丝头套24","STWLFW24",15,16,-1]
["直条半蕾丝头套26","STWLFW26",4,4,0]
["直条半蕾丝头套28","STWLFW28",0,0,0]
["直条半蕾丝头套30","STWLFW30",0,0,0]
["BODY半蕾丝头套10","BWLFW10",5,8,-3]
["BODY半蕾丝头套12","BWLFW12",14,14,0]
["BODY半蕾丝头套14","BWLFW14",15,12,3]
["BODY半蕾丝头套16","BWLFW16",19,18,1]
["BODY半蕾丝头套18","BWLFW18",64,65,-1]
["BODY半蕾丝头套20","BWLFW20",44,46,-2]
["BODY半蕾丝头套22","BWLFW22",22,22,0]
["BODY半蕾丝头套24","BWLFW24",9,8,1]
["DEEP半蕾丝头套10","DEEPLFW10",0,4,-4,"2019-11-08 82批入 5\n2019-10-19 76批入 5",4]
["DEEP半蕾丝头套12","DEEPLFW12",1,5,-4,"2019-10-30 79/80批入 5\n2019-10-26 77/78批入 5",4]
["DEEP半蕾丝头套14","DEEPLFW14",14,14,0]
["DEEP半蕾丝头套16","DEEPLFW16",22,23,-1]
["DEEP半蕾丝头套18","DEEPLFW18",1,0,1]
["DEEP半蕾丝头套20","DEEPLFW20",0,0,0]
["DEEP半蕾丝头套22","DEEPLFW22",9,10,-1]
["DEEP半蕾丝头套24","DEEPLFW24",0,0,0]
["DEEP半蕾丝头套26","DEEPLFW26",0,0,0]
["LOOSEDEEP半蕾丝头套10","LSDPLFW10",9,10,-1]
["LOOSEDEEP半蕾丝头套12","LSDPLFW12",8,9,-1]
["LOOSEDEEP半蕾丝头套14","LSDPLFW14",0,1,-1]
["LOOSEDEEP半蕾丝头套16","LSDPLFW16",0,0,0]
["LOOSEDEEP半蕾丝头套18","LSDPLFW18",7,5,2]
["LOOSEDEEP半蕾丝头套20","LSDPLFW20",0,0,0]
["LOOSEDEEP半蕾丝头套22","LSDPLFW22",4,4,0]
["LOOSEDEEP半蕾丝头套24","LSDPLFW24",7,6,1]
["JC半蕾丝头套12","CURLYLFW12",12,11,1]
["JC半蕾丝头套14","CURLYLFW14",22,27,-5]
["JC半蕾丝头套16","CURLYLFW16",11,13,-2]
["JC半蕾丝头套18","CURLYLFW18",20,20,0]
["JC半蕾丝头套20","CURLYLFW20",17,16,1]
["JC半蕾丝头套22","CURLYLFW22",16,16,0]
["JC半蕾丝头套24","CURLYLFW24",9,10,-1]
["JC半蕾丝头套26","CURLYLFW26",0,0,0]
["自然曲半蕾丝头套10","WATERLFW10",10,5,5,"2019-11-14 83/84批入 5",0]
["自然曲半蕾丝头套12","WATERLFW12",8,7,1]
["自然曲半蕾丝头套14","WATERLFW14",8,4,4,"2019-11-20 86/87批入 5\n2019-10-02 71批入 5",5]
["自然曲半蕾丝头套16","WATERLFW16",9,13,-4,"2019-10-29 77/78批入 10\n2019-10-18 美仓盘点差异入 4",0]
["自然曲半蕾丝头套18","WATERLFW18",5,7,-2]
["自然曲半蕾丝头套20","WATERLFW20",0,17,-17,"2019-10-26 77/78批入 5\n2019-10-18 美仓盘点差异入 15\n2019-10-02 71批入 5",12]
["自然曲半蕾丝头套22","WATERLFW22",2,4,-2]
["613BODY半蕾丝头套12","613BWLFW12",0,0,0]
["613BODY半蕾丝头套14","613BWLFW14",13,13,0]
["613BODY半蕾丝头套16","613BWLFW16",11,11,0]
["613BODY半蕾丝头套18","613BWLFW18",12,13,-1]
["613BODY半蕾丝头套20","613BWLFW20",13,13,0]
["613BODY半蕾丝头套22","613BWLFW22",20,20,0]
["613直发半蕾丝头套12","613STWLFW12",4,12,-8,"2019-11-23 89/90批入 5\n2019-10-19 75/75批入 10",11]
["613直发半蕾丝头套14","613STWLFW14",9,12,-3]
{"$rows_left_out":19}
{"sheet":"11.25待再次核实","index":1,"n_rows":14,"n_cols":10,"rows_kept":14,"cut":false,"hidden":false,"merged":[]}
["尺组合","条码","发货后发货仓库存清点","ERP库存","差异","最新入库情况","出库情况","11.26日发货后的库存","ERP库存","差异"]
["直条半蕾丝头套22","STWLFW22",23,31,-8,"2019/11/23 89/90批入 9\n2019-11-02 81批入 10",21,14,30,{"$f":"H2-I2","v":-16}]
["DEEP半蕾丝头套10","DEEPLFW10",0,4,-4,"2019-11-08 82批入 5\n2019-10-19 76批入 5",4,0,4,{"$f":"H3-I3","v":-4}]
["DEEP半蕾丝头套12","DEEPLFW12",1,5,-4,"2019-10-30 79/80批入 5\n2019-10-26 77/78批入 5",4,0,4,-4]
["自然曲半蕾丝头套10","WATERLFW10",10,5,5,"2019-11-14 83/84批入 5",0,10,5,5]
["自然曲半蕾丝头套14","WATERLFW14",8,4,4,"2019-11-20 86/87批入 5\n2019-10-02 71批入 5",5,7,4,3]
["自然曲半蕾丝头套16","WATERLFW16",9,13,-4,"2019-10-29 77/78批入 10\n2019-10-18 美仓盘点差异入 4",0,9,13,-4]
["自然曲半蕾丝头套20","WATERLFW20",0,17,-17,"2019-10-26 77/78批入 5\n2019-10-18 美仓盘点差异入 15\n2019-10-02 71批入 5",12,0,17,-17]
["613直发半蕾丝头套12","613STWLFW12",4,12,-8,"2019-11-23 89/90批入 5\n2019-10-19 75/75批入 10",11,10,12,-2]
["99JBODY半蕾丝头套16","99JBWLFW16",17,27,-10,"2019-11-16 83/84/85批入 10\n2019-11-08 82批入 10\n2019-10-30 79/80批入 5",3,27,27,0]
["99JBODY半蕾丝头套18","99JBWLFW18",12,23,-11,"2019-11-16 83/84/85批入 10\n2019-11-08 82批入 5\n2019-11-02 81批入 10",12,22,23,-1]
["99JBODY半蕾丝头套20","99JBWLFW20",6,16,-10,"2019-11-20 86/87批入 10\n2019-11-16 83/84/85批入 3\n2019-11-15 83/84/85批入 10",7,16,16,0]
["99JBODY半蕾丝头套22","99JBWLFW22",9,18,-9,"2019-11-20 86/87批入 10\n2019-11-15 83/84/85批入 9",1,18,17,1]
["99J直条半蕾丝头套22","99JSTWLFW22",13,3,10,"2019-11-20 86/87批入 10\n2019-11-15 83/84/85批入 8",15,3,3,0]

{"sheet":"11.26","index":2,"n_rows":143,"n_cols":6,"rows_kept":143,"cut":false,"hidden":false,"merged":[]}
["尺组合","条码","发货后发货仓库存清点","ERP库存","差异","入库情况"]
["613直发BOB头套8","613STWBOB8",34,32,{"$f":"C2-D2","v":2}]
["613直发BOB头套10","613STWBOB10",223,223,{"$f":"C3-D3","v":0}]
["613直发BOB头套12","613STWBOB12",25,31,-6]
["613直发BOB头套14","613STWBOB14",39,42,-3]
["613直发4*4BOB头套8","613STW4*4BOB8","未清点",184]
["613直发4*4BOB头套10","613STW4*4BOB10","未清点",49]
["99J直发Bob头头套8","99JSTWBOB8",27,27,0]
["99J直发Bob头头套10","99JSTWBOB10",24,23,1]
["99J直发Bob头头套12","99JSTWBOB12",25,24,1]
["99J直发Bob头头套14","99JSTWBOB14",19,20,-1]
["#27直条BOB头8","#27STWBOB8",15,14,1]
["#27直条BOB头10","#27STWBOB10",13,12,1]
["#27直条BOB头12","#27STWBOB12",5,5,0]
["#27直条BOB头14","#27STWBOB14",12,12,0]
["直条Bob头8","STWBOB8",40,31,9]
["直条Bob头10","STWBOB10",81,54,27,"2019-11-23 89/90批入库 40\n2019-11-02 81批入库 20"]
["直条Bob头12","STWBOB12",62,42,20,"2019-11-23 89/90批入库 30\n2019-11-20 86/87批入库 30"]
["直条Bob头14","STWBOB14",31,32,-1]
["BODYBOB头8","BWBOB8",7,7,0]
["BODYBOB头10","BWBOB10",14,10,4]
["BODYBOB头12","BWBOB12",4,6,-2]
["BODYBOB头14","BWBOB14",8,11,-3]
["JCBob头8","JCBOB8",29,26,3]
["JCBob头10","JCBOB10",36,39,-3]
["JCBob头12","JCBOB12",1,1,0]
["JCBob头14","JCBOB14",18,15,3]
["DEEPBOB头8","DEEPBOB8",8,9,-1]
["DEEPBOB头10","DEEPBOB10",38,27,11,"2019-11-23 89/90批入库 20\n2019-11-20 86/87批入库10"]
["DEEPBOB头12","DEEPBOB12",1,0,1]
["DEEPBOB头14","DEEPBOB14",0,0,0]
["自然曲BOB头8","WATERBOB8",9,10,-1]
["自然曲BOB头10","WATERBOB10",13,13,0]
["自然曲BOB头12","WATERBOB12",0,0,0]
["自然曲BOB头14","WATERBOB14",0,0,{"$f":"C35-D35","v":0}]
["齐刘海直条BOB头8","BBSTWBOB8",20,20,0]
["齐刘海直条BOB头10","BBSTWBOB10",17,18,-1]
["齐刘海直条BOB头12","BBSTWBOB12",15,18,-3]
["齐刘海直条BOB头14","BBSTWBOB14",3,16,-13,"8月入5\n9月入4"]
["直条360头套10","STW360WIG10",3,3,0]
["直条360头套12","STW360WIG12",3,3,0]
["直条360头套14","STW360WIG14",5,5,0]
["直条360头套16","STW360WIG16",4,4,0]
["直条360头套18","STW360WIG18",8,8,0]
["直条360头套20","STW360WIG20",10,10,0]
["直条360头套22","STW360WIG22",9,9,0]
["直条360头套24","STW360WIG24",10,10,0]
["BODY360头套10","BW360WIG10",14,14,0]
["BODY360头套12","BW360WIG12",17,18,-1]
["BODY360头套14","BW360WIG14",14,14,0]
["BODY360头套16","BW360WIG16",13,12,1]
["BODY360头套18","BW360WIG18",14,16,-2]
["BODY360头套20","BW360WIG20",2,4,-2]
["BODY360头套22","BW360WIG22",16,19,-3]
["BODY360头套24","BW360WIG24",6,6,0]
["JC360头套16","JC360WIG16","未清点",10]
["JC360头套18","JC360WIG18","未清点",10]
["JC360头套20","JC360WIG20","未清点",10]
["JC360头套22","JC360WIG22","未清点",7]
["JC360头套24","JC360WIG24","未清点",15]
{"$rows_left_out":84}
{"sheet":"11.28调整入库","index":3,"n_rows":49,"n_cols":7,"rows_kept":49,"cut":false,"hidden":false,"merged":[]}
["尺组合","条码","数量",null,"尺组合","条码","数量"]
["直条半蕾丝头套10","STWLFW10",6,null,"直条半蕾丝头套18","STWLFW18",-3]
["直条半蕾丝头套12","STWLFW12",2,null,"直条半蕾丝头套20","STWLFW20",-3]
["直条半蕾丝头套14","STWLFW14",1,null,"直条半蕾丝头套24","STWLFW24",-1]
["BODY半蕾丝头套14","BWLFW14",3,null,"BODY半蕾丝头套10","BWLFW10",-3]
["BODY半蕾丝头套16","BWLFW16",1,null,"BODY半蕾丝头套18","BWLFW18",-1]
["BODY半蕾丝头套24","BWLFW24",1,null,"BODY半蕾丝头套20","BWLFW20",-2]
["DEEP半蕾丝头套18","DEEPLFW18",1,null,"DEEP半蕾丝头套16","DEEPLFW16",-1]
["LOOSEDEEP半蕾丝头套18","LSDPLFW18",2,null,"DEEP半蕾丝头套22","DEEPLFW22",-1]
["LOOSEDEEP半蕾丝头套24","LSDPLFW24",1,null,"LOOSEDEEP半蕾丝头套10","LSDPLFW10",-1]
["JC半蕾丝头套12","CURLYLFW12",1,null,"LOOSEDEEP半蕾丝头套12","LSDPLFW12",-1]
["JC半蕾丝头套20","CURLYLFW20",1,null,"LOOSEDEEP半蕾丝头套14","LSDPLFW14",-1]
["自然曲半蕾丝头套12","WATERLFW12",1,null,"JC半蕾丝头套14","CURLYLFW14",-5]
["613直发半蕾丝头套16","613STWLFW16",4,null,"JC半蕾丝头套16","CURLYLFW16",-2]
["99J直发半蕾丝头套14","99JSTWLFW14",1,null,"JC半蕾丝头套24","CURLYLFW24",-1]
["99J直条半蕾丝头套20","99JSTWLFW20",9,null,"自然曲半蕾丝头套18","WATERLFW18",-2]
["自然曲半蕾丝头套10","WATERLFW10",5,null,"自然曲半蕾丝头套22","WATERLFW22",-2]
["自然曲半蕾丝头套14","WATERLFW14",3,null,"613BODY半蕾丝头套18","613BWLFW18",-1]
["99JBODY半蕾丝头套22","99JBWLFW22",1,null,"613直发半蕾丝头套14","613STWLFW14",-3]
["613直发BOB头套8","613STWBOB8",2,null,"99JBODY半蕾丝头套14","99JBWLFW14",-1]
["99J直发Bob头头套10","99JSTWBOB10",1,null,"直条半蕾丝头套22","STWLFW22",-16]
["99J直发Bob头头套12","99JSTWBOB12",1,null,"DEEP半蕾丝头套10","DEEPLFW10",-4]
["#27直条BOB头8","#27STWBOB8",1,null,"DEEP半蕾丝头套12","DEEPLFW12",-4]
["#27直条BOB头10","#27STWBOB10",1,null,"自然曲半蕾丝头套16","WATERLFW16",-4]
["直条Bob头8","STWBOB8",9,null,"自然曲半蕾丝头套20","WATERLFW20",-17]
["BODYBOB头10","BWBOB10",4,null,"613直发半蕾丝头套12","613STWLFW12",-2]
["JCBob头8","JCBOB8",3,null,"99JBODY半蕾丝头套18","99JBWLFW18",-1]
["JCBob头14","JCBOB14",3,null,"613直发BOB头套12","613STWBOB12",-6]
["DEEPBOB头12","DEEPBOB12",1,null,"613直发BOB头套14","613STWBOB14",-3]
["BODY360头套16","BW360WIG16",1,null,"99J直发Bob头头套14","99JSTWBOB14",-1]
["BODY4*4头套12","BW4*4WIG12",2,null,"直条Bob头14","STWBOB14",-1]
["BODY4*4头套14","BW4*4WIG14",2,null,"BODYBOB头12","BWBOB12",-2]
["BODY4*4头套16","BW4*4WIG16",1,null,"BODYBOB头14","BWBOB14",-3]
["BODY4*4头套18","BW4*4WIG18",2,null,"JCBob头10","JCBOB10",-3]
["BODY4*4头套20","BW4*4WIG20",1,null,"DEEPBOB头8","DEEPBOB8",-1]
["DEEP4*4头套14","DEEP4*4WIG14",1,null,"自然曲BOB头8","WATERBOB8",-1]
["DEEP4*4头套16","DEEP4*4WIG16",1,null,"齐刘海直条BOB头10","BBSTWBOB10",-1]
["DEEP4*4头套20","DEEP4*4WIG20",2,null,"齐刘海直条BOB头12","BBSTWBOB12",-3]
["BODY6*6头套14","BW6*6LFW14",1,null,"BODY360头套12","BW360WIG12",-1]
["BODY6*6头套18","BW6*6LFW18",1,null,"BODY360头套18","BW360WIG18",-2]
["BODY6*6头套20","BW6*6LFW20",1,null,"BODY360头套20","BW360WIG20",-2]
["DEEP6*6头套14","DEEP6*6LFW14",1,null,"BODY360头套22","BW360WIG22",-3]
["DEEP6*6头套20","DEEP6*6LFW20",3,null,"DEEP4*4头套22","DEEP4*4WIG22",-1]
["DEEP6*6头套22","DEEP6*6LFW22",1,null,"DEEP6*6头套16","DEEP6*6LFW16",-1]
["DEEP6*6头套24","DEEP6*6LFW24",4,null,"透明蕾丝BODY半蕾丝头套8","TRBWLFW8",-2]
["透明蕾丝BODY半蕾丝头套16","TRBWLFW16",1,null,"透明蕾丝BODY半蕾丝头套14","TRBWLFW14",-1]
["透明蕾丝BODY半蕾丝头套20","TRBWLFW20",1,null,"透明蕾丝BODY半蕾丝头套22","TRBWLFW22",-4]
["透明蕾丝 自然曲半蕾丝头套16","TRWATERLFW16",5,null,"透明蕾丝JC半蕾丝头套14","TRJCLFW14",-4]
[null,null,{"$f":"SUM(C2:C48)","v":102},null,null,null,{"$f":"SUM(G2:G48)","v":-129}]

{"sheet":"11.26待再次核实","index":4,"n_rows":5,"n_cols":8,"rows_kept":5,"cut":false,"hidden":false,"merged":[]}
["尺组合","条码","发货后发货仓库存清点","ERP库存","差异","入库情况","11.27日发货后的库存"]
["直条Bob头10","STWBOB10",81,54,27,"2019-11-23 89/90批入库 40\n2019-11-02 81批入库 20",78,"数据包含了之前的PFSTWBOB10"]
["直条Bob头12","STWBOB12",62,42,20,"2019-11-23 89/90批入库 30\n2019-11-20 86/87批入库 30",62,"数据包含了之前的PFSTWBOB12"]
["DEEPBOB头10","DEEPBOB10",38,27,11,"2019-11-23 89/90批入库 20\n2019-11-20 86/87批入库10",36]
["齐刘海直条BOB头14","BBSTWBOB14",3,16,-13,"8月入5\n9月入4",3]

{"sheet":"11.27","index":5,"n_rows":185,"n_cols":6,"rows_kept":185,"cut":false,"hidden":false,"merged":[[1,5,8,7]]}
["尺组合","条码","发货后发货仓库存清点","ERP库存","差异"]
["613直发4*4BOB头套8","613STW4*4BOB8","未清点",null,null,"本页数据并不包括第91批的到货。"]
["613直发4*4BOB头套10","613STW4*4BOB10","未清点"]
["JC360头套16","JC360WIG16",10,10,0]
["JC360头套18","JC360WIG18",11,10,1]
["JC360头套20","JC360WIG20",9,10,-1]
["JC360头套22","JC360WIG22",7,7,0]
["JC360头套24","JC360WIG24",15,15,0]
["直条4*4头套12","STW4*4WIG12",5,5,0]
["直条4*4头套14","STW4*4WIG14",5,5,0]
["直条4*4头套16","STW4*4WIG16",2,3,-1]
["直条4*4头套18","STW4*4WIG18",2,3,-1]
["直条4*4头套20","STW4*4WIG20",6,6,0]
["直条4*4头套22","STW4*4WIG22",3,3,0]
["直条4*4头套24","STW4*4WIG24",4,4,0]
["自然曲4*4头套12","WATER4*4WIG12",1,1,0]
["直条6*6头套10","STW6*6LFW10",7,7,0]
["直条6*6头套12","STW6*6LFW12",6,6,0]
["直条6*6头套14","STW6*6LFW14",10,10,0]
["直条6*6头套16","STW6*6LFW16",10,6,4]
["直条6*6头套18","STW6*6LFW18",24,24,0]
["直条6*6头套20","STW6*6LFW20",7,7,0]
["直条6*6头套22","STW6*6LFW22",2,3,-1]
["直条6*6头套24","STW6*6LFW24",8,6,2]
["LOOSEDEEP6*6头套14","LSDP6*6LFW14",2,0,2]
["LOOSEDEEP6*6头套16","LSDP6*6LFW16",4,4,0]
["LOOSEDEEP6*6头套18","LSDP6*6LFW18",0,0,0]
["LOOSEDEEP6*6头套20","LSDP6*6LFW20",0,0,0]
["LOOSEDEEP6*6头套22","LSDP6*6LFW22",5,5,0]
["LOOSEDEEP6*6头套24","LSDP6*6LFW24",0,0,0]
["透明蕾丝BODY半蕾丝头套24","TRBWLFW24",0,0,0]
["透明蕾丝BODY半蕾丝头套26","TRBWLFW26",9,9,0]
["透明蕾丝JC半蕾丝头套12","TRJCLFW12",9,9,0]
["透明蕾丝JC半蕾丝头套14","TRJCLFW14",9,5,4]
["透明蕾丝JC半蕾丝头套16","TRJCLFW16",11,12,-1]
["透明蕾丝JC半蕾丝头套18","TRJCLFW18",0,0,0]
["透明蕾丝JC半蕾丝头套20","TRJCLFW20",6,6,0]
["透明蕾丝JC半蕾丝头套22","TRJCLFW22",4,4,0]
["透明蕾丝JC半蕾丝头套24","TRJCLFW24",2,0,2]
["透明蕾丝直发半蕾丝头套12","TRSTWLFW12",1,1,0]
["透明蕾丝直发半蕾丝头套14","TRSTWLFW14",8,8,0]
["透明蕾丝直发半蕾丝头套16","TRSTWLFW16",12,16,-4]
["透明蕾丝直发半蕾丝头套18","TRSTWLFW18",21,21,0]
["透明蕾丝直发半蕾丝头套20","TRSTWLFW20",25,26,-1]
["透明蕾丝直发半蕾丝头套22","TRSTWLFW22",20,20,0]
["透明蕾丝直发半蕾丝头套24","TRSTWLFW24",1,5,-4]
["透明蕾丝直发半蕾丝头套26","TRSTWLFW26",23,13,10]
["透明蕾丝直发半蕾丝头套28","TRSTWLFW28",4,4,0]
["透明蕾丝直发半蕾丝头套30","TRSTWLFW30",8,8,0]
["透明蕾丝自然曲半蕾丝头套14","TRWATERLFW14",0,0,0]
["透明蕾丝自然曲半蕾丝头套16","TRWATERLFW16",10,10,0]
["透明蕾丝 自然曲半蕾丝头套18","TRWATERLFW18",0,5,-5]
["透明蕾丝 自然曲半蕾丝头套20","TRWATERLFW20",0,0,0]
["透明蕾丝 自然曲半蕾丝头套22","TRWATERLFW22",0,0,0]
["直发单条8","STW8","未清点"]
["直发单条10","STW10","未清点"]
["直发单条12","STW12","未清点"]
["直发单条14","STW14","未清点"]
["直发单条16","STW16","未清点"]
["直发单条18","STW18","未清点"]
{"$rows_left_out":126}
{"sheet":"11.29待再次核实","index":6,"n_rows":11,"n_cols":6,"rows_kept":11,"cut":false,"hidden":false,"merged":[]}
["尺组合","条码","发货后发货仓库存清点","ERP库存","差异","11.29日发货后的库存"]
["直条6*6头套16","STW6*6LFW16",10,6,4,9]
["透明蕾丝JC半蕾丝头套14","TRJCLFW14",9,5,4,9]
["透明蕾丝直发半蕾丝头套16","TRSTWLFW16",12,16,-4,11]
["透明蕾丝直发半蕾丝头套24","TRSTWLFW24",1,5,-4,0]
["透明蕾丝 自然曲半蕾丝头套18","TRWATERLFW18",0,5,-5,5]
["直条3D-13*6头套20","STW3D13*6WIG20",22,12,10,22]
["BODY 3D-13*6头套12","BW3D13*6WIG12",9,14,-5,9]
["BODY 3D-13*6头套16","BW3D13*6WIG16",19,36,-17,36]
["透明直条6*6头套12","TRSTW6*6LFW12",5,null,5,5]
["透明直条6*6头套22","TRSTW6*6LFW22",18,23,-5,18]

{"sheet":"12.02","index":7,"n_rows":725,"n_cols":5,"rows_kept":725,"cut":false,"hidden":false,"merged":[]}
["尺组合","条码","12.02发货后发货仓库存清点","ERP库存","差异"]
["613直发4*4BOB头套8","613STW4*4BOB8",null,{"$f":"VLOOKUP(B:B,[1]库存明细!$D:$H,5,0)","v":262},{"$f":"C2-D2","v":-262}]
["613直发4*4BOB头套10","613STW4*4BOB10",null,{"$f":"VLOOKUP(B:B,[1]库存明细!$D:$H,5,0)","v":36},{"$f":"C3-D3","v":-36}]
["直条4x4发块8","FCSTW8",null,{"$f":"VLOOKUP(B:B,[1]库存明细!$D:$H,5,0)","v":13},-13]
["直条4x4发块10","FCSTW10",null,{"$f":"VLOOKUP(B:B,[1]库存明细!$D:$H,5,0)","v":42},-42]
["直条4x4发块12","FCSTW12",null,{"$f":"VLOOKUP(B:B,[1]库存明细!$D:$H,5,0)","v":18},-18]
["直条4x4发块14","FCSTW14",null,{"$f":"VLOOKUP(B:B,[1]库存明细!$D:$H,5,0)","v":31},-31]
["直条4x4发块16","FCSTW16",null,{"$f":"VLOOKUP(B:B,[1]库存明细!$D:$H,5,0)","v":25},-25]
["直条4x4发块18","FCSTW18",null,{"$f":"VLOOKUP(B:B,[1]库存明细!$D:$H,5,0)","v":23},-23]
["直条4x4发块20","FCSTW20",null,{"$f":"VLOOKUP(B:B,[1]库存明细!$D:$H,5,0)","v":21},-21]
["中分直条4x4发块8","MCSTW8",null,{"$f":"VLOOKUP(B:B,[1]库存明细!$D:$H,5,0)","v":9},-9]
["中分直条4x4发块10","MCSTW10",null,{"$f":"VLOOKUP(B:B,[1]库存明细!$D:$H,5,0)","v":14},-14]
["中分直条4x4发块12","MCSTW12",null,{"$f":"VLOOKUP(B:B,[1]库存明细!$D:$H,5,0)","v":8},-8]
["中分直条4x4发块14","MCSTW14",null,{"$f":"VLOOKUP(B:B,[1]库存明细!$D:$H,5,0)","v":29},-29]
["中分直条4x4发块16","MCSTW16",null,{"$f":"VLOOKUP(B:B,[1]库存明细!$D:$H,5,0)","v":13},-13]
["中分直条4x4发块18","MCSTW18",null,{"$f":"VLOOKUP(B:B,[1]库存明细!$D:$H,5,0)","v":28},-28]
["中分直条4x4发块20","MCSTW20",null,{"$f":"VLOOKUP(B:B,[1]库存明细!$D:$H,5,0)","v":20},-20]
["直条5x5发块10","FC5*5STW10",null,{"$f":"VLOOKUP(B:B,[1]库存明细!$D:$H,5,0)","v":10},-10]
["直条5x5发块12","FC5*5STW12",null,{"$f":"VLOOKUP(B:B,[1]库存明细!$D:$H,5,0)","v":12},-12]
["直条5x5发块14","FC5*5STW14",null,{"$f":"VLOOKUP(B:B,[1]库存明细!$D:$H,5,0)","v":20},-20]
["直条5x5发块16","FC5*5STW16",null,{"$f":"VLOOKUP(B:B,[1]库存明细!$D:$H,5,0)","v":16},-16]
["直条5x5发块18","FC5*5STW18",null,{"$f":"VLOOKUP(B:B,[1]库存明细!$D:$H,5,0)","v":19},-19]
["直条5x5发块20","FC5*5STW20",null,{"$f":"VLOOKUP(B:B,[1]库存明细!$D:$H,5,0)","v":17},-17]
["中分直条5x5发块10","MC5*5STW10",null,{"$f":"VLOOKUP(B:B,[1]库存明细!$D:$H,5,0)","v":7},-7]
["中分直条5x5发块12","MC5*5STW12",null,{"$f":"VLOOKUP(B:B,[1]库存明细!$D:$H,5,0)","v":12},-12]
["中分直条5x5发块14","MC5*5STW14",null,{"$f":"VLOOKUP(B:B,[1]库存明细!$D:$H,5,0)","v":10},-10]
["中分直条5x5发块16","MC5*5STW16",null,{"$f":"VLOOKUP(B:B,[1]库存明细!$D:$H,5,0)","v":12},-12]
["中分直条5x5发块18","MC5*5STW18",null,{"$f":"VLOOKUP(B:B,[1]库存明细!$D:$H,5,0)","v":18},-18]
["中分直条5x5发块20","MC5*5STW20",null,{"$f":"VLOOKUP(B:B,[1]库存明细!$D:$H,5,0)","v":12},-12]
["直条6*6自由分发块12","FC6*6STW12",null,{"$f":"VLOOKUP(B:B,[1]库存明细!$D:$H,5,0)","v":18},-18]
["直条6*6自由分发块14","FC6*6STW14",null,{"$f":"VLOOKUP(B:B,[1]库存明细!$D:$H,5,0)","v":14},-14]
["直条6*6自由分发块16","FC6*6STW16",null,{"$f":"VLOOKUP(B:B,[1]库存明细!$D:$H,5,0)","v":16},-16]
["直条6*6自由分发块18","FC6*6STW18",null,{"$f":"VLOOKUP(B:B,[1]库存明细!$D:$H,5,0)","v":21},-21]
["直条6*6自由分发块20","FC6*6STW20",null,{"$f":"VLOOKUP(B:B,[1]库存明细!$D:$H,5,0)","v":9},-9]
["中分直条6*6发块10","MC6*6STW10",null,{"$f":"VLOOKUP(B:B,[1]库存明细!$D:$H,5,0)","v":5},-5]
["中分直条6*6发块12","MC6*6STW12",null,{"$f":"VLOOKUP(B:B,[1]库存明细!$D:$H,5,0)","v":10},-10]
["中分直条6*6发块14","MC6*6STW14",null,{"$f":"VLOOKUP(B:B,[1]库存明细!$D:$H,5,0)","v":9},-9]
["中分直条6*6发块16","MC6*6STW16",null,{"$f":"VLOOKUP(B:B,[1]库存明细!$D:$H,5,0)","v":11},-11]
["中分直条6*6发块18","MC6*6STW18",null,{"$f":"VLOOKUP(B:B,[1]库存明细!$D:$H,5,0)","v":27},-27]
["中分直条6*6发块20","MC6*6STW20",null,{"$f":"VLOOKUP(B:B,[1]库存明细!$D:$H,5,0)","v":9},-9]
["直发蕾丝前头8","FROSTW8",null,{"$f":"VLOOKUP(B:B,[1]库存明细!$D:$H,5,0)","v":24},-24]
["直发蕾丝前头10","FROSTW10",null,{"$f":"VLOOKUP(B:B,[1]库存明细!$D:$H,5,0)","v":41},-41]
["直发蕾丝前头12","FROSTW12",null,{"$f":"VLOOKUP(B:B,[1]库存明细!$D:$H,5,0)","v":29},-29]
["直发蕾丝前头14","FROSTW14",null,{"$f":"VLOOKUP(B:B,[1]库存明细!$D:$H,5,0)","v":11},-11]
["直发蕾丝前头16","FROSTW16",null,{"$f":"VLOOKUP(B:B,[1]库存明细!$D:$H,5,0)","v":10},-10]
["直发蕾丝前头18","FROSTW18",null,{"$f":"VLOOKUP(B:B,[1]库存明细!$D:$H,5,0)","v":24},-24]
["直发蕾丝前头20","FROSTW20",null,{"$f":"VLOOKUP(B:B,[1]库存明细!$D:$H,5,0)","v":25},-25]
["直条13*6大前头10","FRO13*6STW10",null,{"$f":"VLOOKUP(B:B,[1]库存明细!$D:$H,5,0)","v":12},-12]
["直条13*6大前头12","FRO13*6STW12",null,{"$f":"VLOOKUP(B:B,[1]库存明细!$D:$H,5,0)","v":11},-11]
["直条13*6大前头14","FRO13*6STW14",null,{"$f":"VLOOKUP(B:B,[1]库存明细!$D:$H,5,0)","v":7},-7]
["直条13*6大前头16","FRO13*6STW16",null,{"$f":"VLOOKUP(B:B,[1]库存明细!$D:$H,5,0)","v":6},-6]
["直条13*6大前头18","FRO13*6STW18",null,{"$f":"VLOOKUP(B:B,[1]库存明细!$D:$H,5,0)","v":8},-8]
["直条13*6大前头20","FRO13*6STW20",null,{"$f":"VLOOKUP(B:B,[1]库存明细!$D:$H,5,0)","v":13},-13]
["直发单条8","STW8",null,{"$f":"VLOOKUP(B:B,[1]库存明细!$D:$H,5,0)","v":23},-23]
["直发单条10","STW10",null,{"$f":"VLOOKUP(B:B,[1]库存明细!$D:$H,5,0)","v":38},-38]
["直发单条12","STW12",null,{"$f":"VLOOKUP(B:B,[1]库存明细!$D:$H,5,0)","v":62},-62]
["直发单条14","STW14",null,{"$f":"VLOOKUP(B:B,[1]库存明细!$D:$H,5,0)","v":48},-48]
["直发单条16","STW16",null,{"$f":"VLOOKUP(B:B,[1]库存明细!$D:$H,5,0)","v":59},-59]
["直发单条18","STW18",null,{"$f":"VLOOKUP(B:B,[1]库存明细!$D:$H,5,0)","v":88},-88]
["直发单条20","STW20",null,{"$f":"VLOOKUP(B:B,[1]库存明细!$D:$H,5,0)","v":83},-83]
{"$rows_left_out":666}
{"sheet":"12.02待再次确认","index":8,"n_rows":726,"n_cols":8,"rows_kept":726,"cut":false,"hidden":false,"merged":[]}
["尺组合","条码","12.02发货后发货仓库存清点","ERP库存","差异","12.03发货后再次确认"]
["613直发4*4BOB头套8","613STW4*4BOB8",null,{"$f":"VLOOKUP(B:B,[1]库存明细!$D:$H,5,0)","v":262},{"$f":"C2-D2","v":-262}]
["613直发4*4BOB头套10","613STW4*4BOB10",null,{"$f":"VLOOKUP(B:B,[1]库存明细!$D:$H,5,0)","v":36},-36]
["直条4x4发块8","FCSTW8",null,{"$f":"VLOOKUP(B:B,[1]库存明细!$D:$H,5,0)","v":13},-13]
["直条4x4发块10","FCSTW10",null,{"$f":"VLOOKUP(B:B,[1]库存明细!$D:$H,5,0)","v":42},-42]
["直条4x4发块12","FCSTW12",null,{"$f":"VLOOKUP(B:B,[1]库存明细!$D:$H,5,0)","v":18},-18]
["直条4x4发块14","FCSTW14",null,{"$f":"VLOOKUP(B:B,[1]库存明细!$D:$H,5,0)","v":31},-31]
["直条4x4发块16","FCSTW16",null,{"$f":"VLOOKUP(B:B,[1]库存明细!$D:$H,5,0)","v":25},-25]
["直条4x4发块18","FCSTW18",null,{"$f":"VLOOKUP(B:B,[1]库存明细!$D:$H,5,0)","v":23},-23]
["直条4x4发块20","FCSTW20",null,{"$f":"VLOOKUP(B:B,[1]库存明细!$D:$H,5,0)","v":21},-21]
["中分直条4x4发块8","MCSTW8",null,{"$f":"VLOOKUP(B:B,[1]库存明细!$D:$H,5,0)","v":9},-9]
["中分直条4x4发块10","MCSTW10",null,{"$f":"VLOOKUP(B:B,[1]库存明细!$D:$H,5,0)","v":14},-14]
["中分直条4x4发块12","MCSTW12",null,{"$f":"VLOOKUP(B:B,[1]库存明细!$D:$H,5,0)","v":8},-8]
["中分直条4x4发块14","MCSTW14",null,{"$f":"VLOOKUP(B:B,[1]库存明细!$D:$H,5,0)","v":29},-29]
["中分直条4x4发块16","MCSTW16",null,{"$f":"VLOOKUP(B:B,[1]库存明细!$D:$H,5,0)","v":13},-13]
["中分直条4x4发块18","MCSTW18",null,{"$f":"VLOOKUP(B:B,[1]库存明细!$D:$H,5,0)","v":28},-28]
["中分直条4x4发块20","MCSTW20",null,{"$f":"VLOOKUP(B:B,[1]库存明细!$D:$H,5,0)","v":20},-20]
["直条5x5发块10","FC5*5STW10",null,{"$f":"VLOOKUP(B:B,[1]库存明细!$D:$H,5,0)","v":10},-10]
["直条5x5发块12","FC5*5STW12",null,{"$f":"VLOOKUP(B:B,[1]库存明细!$D:$H,5,0)","v":12},-12]
["直条5x5发块14","FC5*5STW14",null,{"$f":"VLOOKUP(B:B,[1]库存明细!$D:$H,5,0)","v":20},-20]
["直条5x5发块16","FC5*5STW16",null,{"$f":"VLOOKUP(B:B,[1]库存明细!$D:$H,5,0)","v":16},-16]
["直条5x5发块18","FC5*5STW18",null,{"$f":"VLOOKUP(B:B,[1]库存明细!$D:$H,5,0)","v":19},-19]
["直条5x5发块20","FC5*5STW20",null,{"$f":"VLOOKUP(B:B,[1]库存明细!$D:$H,5,0)","v":17},-17]
["中分直条5x5发块10","MC5*5STW10",null,{"$f":"VLOOKUP(B:B,[1]库存明细!$D:$H,5,0)","v":7},-7]
["中分直条5x5发块12","MC5*5STW12",null,{"$f":"VLOOKUP(B:B,[1]库存明细!$D:$H,5,0)","v":12},-12]
["中分直条5x5发块14","MC5*5STW14",null,{"$f":"VLOOKUP(B:B,[1]库存明细!$D:$H,5,0)","v":10},-10]
["中分直条5x5发块16","MC5*5STW16",null,{"$f":"VLOOKUP(B:B,[1]库存明细!$D:$H,5,0)","v":12},-12]
["中分直条5x5发块18","MC5*5STW18",null,{"$f":"VLOOKUP(B:B,[1]库存明细!$D:$H,5,0)","v":18},-18]
["中分直条5x5发块20","MC5*5STW20",null,{"$f":"VLOOKUP(B:B,[1]库存明细!$D:$H,5,0)","v":12},-12]
["直条6*6自由分发块12","FC6*6STW12",null,{"$f":"VLOOKUP(B:B,[1]库存明细!$D:$H,5,0)","v":18},-18]
["直条6*6自由分发块14","FC6*6STW14",null,{"$f":"VLOOKUP(B:B,[1]库存明细!$D:$H,5,0)","v":14},-14]
["直条6*6自由分发块16","FC6*6STW16",null,{"$f":"VLOOKUP(B:B,[1]库存明细!$D:$H,5,0)","v":16},-16]
["直条6*6自由分发块18","FC6*6STW18",null,{"$f":"VLOOKUP(B:B,[1]库存明细!$D:$H,5,0)","v":21},-21]
["直条6*6自由分发块20","FC6*6STW20",null,{"$f":"VLOOKUP(B:B,[1]库存明细!$D:$H,5,0)","v":9},-9]
["中分直条6*6发块10","MC6*6STW10",null,{"$f":"VLOOKUP(B:B,[1]库存明细!$D:$H,5,0)","v":5},-5]
["中分直条6*6发块12","MC6*6STW12",null,{"$f":"VLOOKUP(B:B,[1]库存明细!$D:$H,5,0)","v":10},-10]
["中分直条6*6发块14","MC6*6STW14",null,{"$f":"VLOOKUP(B:B,[1]库存明细!$D:$H,5,0)","v":9},-9]
["中分直条6*6发块16","MC6*6STW16",null,{"$f":"VLOOKUP(B:B,[1]库存明细!$D:$H,5,0)","v":11},-11]
["中分直条6*6发块18","MC6*6STW18",null,{"$f":"VLOOKUP(B:B,[1]库存明细!$D:$H,5,0)","v":27},-27]
["中分直条6*6发块20","MC6*6STW20",null,{"$f":"VLOOKUP(B:B,[1]库存明细!$D:$H,5,0)","v":9},-9]
["直发蕾丝前头8","FROSTW8",null,{"$f":"VLOOKUP(B:B,[1]库存明细!$D:$H,5,0)","v":24},-24]
["直发蕾丝前头10","FROSTW10",null,{"$f":"VLOOKUP(B:B,[1]库存明细!$D:$H,5,0)","v":41},-41]
["直发蕾丝前头12","FROSTW12",null,{"$f":"VLOOKUP(B:B,[1]库存明细!$D:$H,5,0)","v":29},-29]
["直发蕾丝前头14","FROSTW14",null,{"$f":"VLOOKUP(B:B,[1]库存明细!$D:$H,5,0)","v":11},-11]
["直发蕾丝前头16","FROSTW16",null,{"$f":"VLOOKUP(B:B,[1]库存明细!$D:$H,5,0)","v":10},-10]
["直发蕾丝前头18","FROSTW18",null,{"$f":"VLOOKUP(B:B,[1]库存明细!$D:$H,5,0)","v":24},-24]
["直发蕾丝前头20","FROSTW20",null,{"$f":"VLOOKUP(B:B,[1]库存明细!$D:$H,5,0)","v":25},-25]
["直条13*6大前头10","FRO13*6STW10",null,{"$f":"VLOOKUP(B:B,[1]库存明细!$D:$H,5,0)","v":12},-12]
["直条13*6大前头12","FRO13*6STW12",null,{"$f":"VLOOKUP(B:B,[1]库存明细!$D:$H,5,0)","v":11},-11]
["直条13*6大前头14","FRO13*6STW14",null,{"$f":"VLOOKUP(B:B,[1]库存明细!$D:$H,5,0)","v":7},-7]
["直条13*6大前头16","FRO13*6STW16",null,{"$f":"VLOOKUP(B:B,[1]库存明细!$D:$H,5,0)","v":6},-6]
["直条13*6大前头18","FRO13*6STW18",null,{"$f":"VLOOKUP(B:B,[1]库存明细!$D:$H,5,0)","v":8},-8]
["直条13*6大前头20","FRO13*6STW20",null,{"$f":"VLOOKUP(B:B,[1]库存明细!$D:$H,5,0)","v":13},-13]
["直发单条8","STW8",null,{"$f":"VLOOKUP(B:B,[1]库存明细!$D:$H,5,0)","v":23},-23]
["直发单条10","STW10",null,{"$f":"VLOOKUP(B:B,[1]库存明细!$D:$H,5,0)","v":38},-38]
["直发单条12","STW12",null,{"$f":"VLOOKUP(B:B,[1]库存明细!$D:$H,5,0)","v":62},-62]
["直发单条14","STW14",null,{"$f":"VLOOKUP(B:B,[1]库存明细!$D:$H,5,0)","v":48},-48]
["直发单条16","STW16",null,{"$f":"VLOOKUP(B:B,[1]库存明细!$D:$H,5,0)","v":59},-59]
["直发单条18","STW18",null,{"$f":"VLOOKUP(B:B,[1]库存明细!$D:$H,5,0)","v":88},-88]
["直发单条20","STW20",null,{"$f":"VLOOKUP(B:B,[1]库存明细!$D:$H,5,0)","v":83},-83]
{"$rows_left_out":667}
{"sheet":"12.03","index":9,"n_rows":583,"n_cols":4,"rows_kept":583,"cut":false,"hidden":false,"merged":[]}
["尺组合","条码","发货后发货仓库存清点","ERP库存"]
["613直发4*4BOB头套8","613STW4*4BOB8"]
["613直发4*4BOB头套10","613STW4*4BOB10"]
["直条4x4发块8","FCSTW8"]
["直条4x4发块10","FCSTW10"]
["直条4x4发块12","FCSTW12"]
["直条4x4发块14","FCSTW14"]
["直条4x4发块16","FCSTW16"]
["直条4x4发块18","FCSTW18"]
["直条4x4发块20","FCSTW20"]
["中分直条4x4发块8","MCSTW8"]
["中分直条4x4发块10","MCSTW10"]
["中分直条4x4发块12","MCSTW12"]
["中分直条4x4发块14","MCSTW14"]
["中分直条4x4发块16","MCSTW16"]
["中分直条4x4发块18","MCSTW18"]
["中分直条4x4发块20","MCSTW20"]
["直条5x5发块10","FC5*5STW10"]
["直条5x5发块12","FC5*5STW12"]
["直条5x5发块14","FC5*5STW14"]
["直条5x5发块16","FC5*5STW16"]
["直条5x5发块18","FC5*5STW18"]
["直条5x5发块20","FC5*5STW20"]
["中分直条5x5发块10","MC5*5STW10"]
["中分直条5x5发块12","MC5*5STW12"]
["中分直条5x5发块14","MC5*5STW14"]
["中分直条5x5发块16","MC5*5STW16"]
["中分直条5x5发块18","MC5*5STW18"]
["中分直条5x5发块20","MC5*5STW20"]
["直条6*6自由分发块12","FC6*6STW12"]
["直条6*6自由分发块14","FC6*6STW14"]
["直条6*6自由分发块16","FC6*6STW16"]
["直条6*6自由分发块18","FC6*6STW18"]
["直条6*6自由分发块20","FC6*6STW20"]
["中分直条6*6发块10","MC6*6STW10"]
["中分直条6*6发块12","MC6*6STW12"]
["中分直条6*6发块14","MC6*6STW14"]
["中分直条6*6发块16","MC6*6STW16"]
["中分直条6*6发块18","MC6*6STW18"]
["中分直条6*6发块20","MC6*6STW20"]
["直发蕾丝前头8","FROSTW8"]
["直发蕾丝前头10","FROSTW10"]
["直发蕾丝前头12","FROSTW12"]
["直发蕾丝前头14","FROSTW14"]
["直发蕾丝前头16","FROSTW16"]
["直发蕾丝前头18","FROSTW18"]
["直发蕾丝前头20","FROSTW20"]
["直条13*6大前头10","FRO13*6STW10"]
["直条13*6大前头12","FRO13*6STW12"]
["直条13*6大前头14","FRO13*6STW14"]
["直条13*6大前头16","FRO13*6STW16"]
["直条13*6大前头18","FRO13*6STW18"]
["直条13*6大前头20","FRO13*6STW20"]
["直发单条8","STW8"]
["直发单条10","STW10"]
["直发单条12","STW12"]
["直发单条14","STW14"]
["直发单条16","STW16"]
["直发单条18","STW18"]
["直发单条20","STW20"]
{"$rows_left_out":523}